{"text_format":"1","workbook":"xlsx","n_sheets":16,"sheets":["Calculator","enter_aq_data","aqi_data","aqi_tally","aqi_breaks_usa","aqi_breaks_eu","aqi_breaks_uk","aqi_breaks_india","aqi_breaks_china","aqi_breaks_skorea","aqi_breaks_singapore","Equations","Unit_Conversion","break_point_tally","Concentrations","Country"],"not_rendered":{"charts":0,"images":2,"macros":1,"external_links":4,"defined_names":30,"comments":0,"pivot_tables":0},"unopened":[],"bounds":{"document_bytes":16777216,"sheet_cells":100000,"rows_first":2000,"rows_last":500,"rows_between":2000,"halvings":0,"cell_chars":16384,"cell_head_chars":4096},"cells_cut":0,"cells_raw":0,"read":"whole","date_system":"1900"}

{"sheet":"Calculator","index":0,"n_rows":17,"n_cols":9,"rows_kept":17,"cut":false,"hidden":false,"merged":[[8,8,8,12],[6,1,6,3],[6,4,6,5],[4,4,4,5],[4,1,4,3]]}
[]
[]
[]
[]
[null,"Select a pollutant to calculate AQI",null,null,"PM10"]
[]
[null,"Select data time frame entered",null,null,"24hr"]
[null,null,null,null,null,null,null,null,"Version.2: Calculates AQI for long-term data and stats for various country methods"]
[null,"Country","Validity","<-- check if selection is valid or not",null,null,null,null,"Assumes all the concentrations are in micro-gm/m3"]
[null,"USA","Valid",null,null,null,null,null,"Data format must be maintained and entered as shown in \"enter_aq_data\""]
{"$rows_left_out":8}
{"sheet":"enter_aq_data","index":1,"n_rows":365,"n_cols":10,"rows_kept":365,"cut":false,"hidden":false,"merged":[]}
["Date","YYYY","MM","DD","PM2.5","PM10","SO2","NO2","CO","Ozone"]
["2020-08-04",{"$f":"YEAR(A2)","v":2020},{"$f":"MONTH(A2)","v":8},{"$f":"DAY(A2)","v":4},37.530500647058815,83.5285497647059,96.6,18.772222222222222,7516.6666666666679,17.374444444444446]
["2020-08-05",2020,8,5,18.831977041666654,39.696300416666659,61.634166666666665,17.767916666666665,3214.5833333333335,23.287499999999998]
["2020-08-06",2020,8,6,15.281708583333334,32.11872808333333,56.333750000000002,17.948333333333334,2168.7499999999995,35.199583333333329]
["2020-08-07",2020,8,7,35.107213249999994,78.228757083333306,49.961666666666652,20.85541666666666,3117.9166666666665,43.457083333333316]
["2020-08-08",2020,8,8,47.693412291666675,106.42262616666663,39.999166666666653,18.417083333333334,1954.5833333333335,54.373333333333342]
["2020-08-09",2020,8,9,54.674829166666669,124.55365108333335,36.947916666666664,15.154583333333333,1540.4166666666665,50.102083333333333]
["2020-08-10",2020,8,10,38.645201291666666,90.082142916666669,40.90291666666667,14.710833333333332,1725.4166666666667,48.583333333333343]
["2020-08-11",2020,8,11,38.888353541666675,87.77950633333333,42.682083333333338,15.440416666666666,1372.083333333333,63.535000000000018]
["2020-08-12",2020,8,12,58.774032249999976,133.99338674999996,35.319166666666668,18.548333333333336,1912.0833333333333,59.002083333333339]
{"$rows_left_out":356}
{"sheet":"aqi_data","index":2,"n_rows":368,"n_cols":7,"rows_kept":368,"cut":false,"hidden":false,"merged":[[0,0,2,5],[0,6,2,6]]}
["CALCULATED AQI USING COUNTRY SPECIFIC METHODOLOGY",null,null,null,null,null,{"$f":"INDEX(Country!H9:H16,Country!G7)","v":"PM10"}]
[]
[]
["USA","EU","UK","India","China","S.Korea","Singapore"]
[64.76427488235295,267.0570995294118,7.0660687205882375,83.5285497647059,66.76427488235295,104.41068720588237,66.76427488235295]
[36.755833719135794,99.240751041666641,2.3939000245098034,39.696300416666659,39.696300416666659,59.696300416666659,39.696300416666659]
[29.739563040123453,80.29682020833333,1.948160475490196,32.11872808333333,32.11872808333333,52.11872808333333,32.11872808333333]
[62.114378541666653,256.45751416666661,6.4035946354166633,78.228757083333306,64.114378541666653,98.228757083333306,64.114378541666653]
[76.211313083333323,312.84525233333329,9.1284525233333333,104.28175077777776,78.211313083333323,133.02828270833328,78.211313083333323]
[85.276825541666682,349.10730216666673,9.4910730216666668,116.36910072222223,87.276825541666682,155.69206385416669,87.276825541666682]
{"$rows_left_out":359}
{"sheet":"aqi_tally","index":3,"n_rows":29,"n_cols":9,"rows_kept":29,"cut":false,"hidden":false,"merged":[[0,0,2,5],[0,6,2,6],[0,7,2,7],[17,1,17,7]]}
["AQI TALLY by COUNTRY METHODS",null,null,null,null,null,{"$f":"INDEX(Country!H9:H16,Country!G7)","v":"PM10"},{"$f":"Calculator!E13","v":364}]
[null,null,null,null,null,null,null,null,"< -- no.of.points"]
[]
[null,"USA","EU","UK","India","China","S.Korea","Singapore"]
["no.of.bins -->",{"$f":"aqi_breaks_usa!B6","v":6},{"$f":"aqi_breaks_eu!B6","v":6},{"$f":"aqi_breaks_uk!B6","v":10},{"$f":"aqi_breaks_india!B6","v":6},{"$f":"aqi_breaks_china!B6","v":6},{"$f":"aqi_breaks_skorea!B6","v":6},{"$f":"aqi_breaks_singapore!B6","v":6}]
[]
["Bin1",37,2,1,31,31,8,31]
["Bin2",291,16,8,147,290,104,290]
["Bin3",27,13,22,177,37,142,37]
["Bin4",3,147,15,3,3,92,3]
{"$rows_left_out":20}
{"sheet":"aqi_breaks_usa","index":4,"n_rows":32,"n_cols":24,"rows_kept":32,"cut":false,"hidden":false,"merged":[[8,3,8,4],[0,1,2,1],[0,2,2,15],[20,6,20,23],[4,6,4,23]]}
[null,1,"USA AQI Break Points Information"]
[]
[]
[]
[null,"Number of bins",null,"Number of polls",null,null,"Break Points"]
[null,{"$f":"MAX(B11:B20)","v":6},null,{"$f":"MAX(G6:X6)","v":18},null,null,1,2,3,4,5,6,7,8,9,10,11,12,13,14,15,16,17,18]
[null,null,null,null,null,null,"PM2.5","PM2.5","PM2.5","PM10","PM10","PM10","SO2","SO2","SO2","NO2","NO2","NO2","CO","CO","CO","Ozone","Ozone","Ozone"]
[null,null,null,null,null,null,"24hr","8hr","1hr","24hr","8hr","1hr","24hr","8hr","1hr","24hr","8hr","1hr","24hr","8hr","1hr","24hr","8hr","1hr"]
[null,null,null,"AQI",null,null,"ug/m3","ug/m3","ug/m3","ug/m3","ug/m3","ug/m3","ug/m3","ug/m3","ug/m3","ug/m3","ug/m3","ug/m3","ug/m3","ug/m3","ug/m3","ug/m3","ug/m3","ug/m3"]
[null,null,null,"Low","High","col.code",0,null,null,0,null,null,0,null,null,0,null,null,null,0,null,null,0,0]
{"$rows_left_out":23}
{"sheet":"aqi_breaks_eu","index":5,"n_rows":16,"n_cols":24,"rows_kept":16,"cut":false,"hidden":false,"merged":[[8,3,8,4],[0,1,2,1],[0,2,2,15],[4,6,4,23]]}
[null,2,"EU AQI Break Points Information"]
[]
[]
[]
[null,"Number of bins",null,"Number of polls",null,null,"Break Points"]
[null,{"$f":"MAX(B11:B20)","v":6},null,{"$f":"MAX(G6:X6)","v":18},null,null,1,2,3,4,5,6,7,8,9,10,11,12,13,14,15,16,17,18]
[null,null,null,null,null,null,"PM2.5","PM2.5","PM2.5","PM10","PM10","PM10","SO2","SO2","SO2","NO2","NO2","NO2","CO","CO","CO","Ozone","Ozone","Ozone"]
[null,null,null,null,null,null,"24hr","8hr","1hr","24hr","8hr","1hr","24hr","8hr","1hr","24hr","8hr","1hr","24hr","8hr","1hr","24hr","8hr","1hr"]
[null,null,null,"AQI",null,null,"ug/m3","ug/m3","ug/m3","ug/m3","ug/m3","ug/m3","ug/m3","ug/m3","ug/m3","ug/m3","ug/m3","ug/m3","ug/m3","ug/m3","ug/m3","ug/m3","ug/m3","ug/m3"]
[null,null,null,"Low","High","col.code",0,null,null,0,null,null,null,null,0,null,null,0,null,null,null,null,null,0]
{"$rows_left_out":7}
{"sheet":"aqi_breaks_uk","index":6,"n_rows":20,"n_cols":24,"rows_kept":20,"cut":false,"hidden":false,"merged":[[8,3,8,4],[0,1,2,1],[0,2,2,15],[4,6,4,23]]}
[null,3,"UK AQI Break Points Information"]
[]
[]
[]
[null,"Number of bins",null,"Number of polls",null,null,"Break Points"]
[null,{"$f":"MAX(B11:B20)","v":10},null,{"$f":"MAX(G6:X6)","v":18},null,null,1,2,3,4,5,6,7,8,9,10,11,12,13,14,15,16,17,18]
[null,null,null,null,null,null,"PM2.5","PM2.5","PM2.5","PM10","PM10","PM10","SO2","SO2","SO2","NO2","NO2","NO2","CO","CO","CO","Ozone","Ozone","Ozone"]
[null,null,null,null,null,null,"24hr","8hr","1hr","24hr","8hr","1hr","24hr","8hr","1hr","24hr","8hr","1hr","24hr","8hr","1hr","24hr","8hr","1hr"]
[null,null,null,"AQI",null,null,"ug/m3","ug/m3","ug/m3","ug/m3","ug/m3","ug/m3","ug/m3","ug/m3","ug/m3","ug/m3","ug/m3","ug/m3","ug/m3","ug/m3","ug/m3","ug/m3","ug/m3","ug/m3"]
[null,null,null,"Low","High","col.code",0,null,null,0,null,null,null,null,0,null,null,0,null,null,null,null,0]
{"$rows_left_out":11}
{"sheet":"aqi_breaks_india","index":7,"n_rows":16,"n_cols":24,"rows_kept":16,"cut":false,"hidden":false,"merged":[[8,3,8,4],[4,6,4,23],[0,1,2,1],[0,2,2,15]]}
[null,4,"INDIA AQI Break Points Information"]
[]
[]
[]
[null,"Number of bins",null,"Number of polls",null,null,"Break Points"]
[null,{"$f":"MAX(B11:B20)","v":6},null,{"$f":"MAX(G6:X6)","v":18},null,null,1,2,3,4,5,6,7,8,9,10,11,12,13,14,15,16,17,18]
[null,null,null,null,null,null,"PM2.5","PM2.5","PM2.5","PM10","PM10","PM10","SO2","SO2","SO2","NO2","NO2","NO2","CO","CO","CO","Ozone","Ozone","Ozone"]
[null,null,null,null,null,null,"24hr","8hr","1hr","24hr","8hr","1hr","24hr","8hr","1hr","24hr","8hr","1hr","24hr","8hr","1hr","24hr","8hr","1hr"]
[null,null,null,"AQI",null,null,"ug/m3","ug/m3","ug/m3","ug/m3","ug/m3","ug/m3","ug/m3","ug/m3","ug/m3","ug/m3","ug/m3","ug/m3","ug/m3","ug/m3","ug/m3","ug/m3","ug/m3","ug/m3"]
[null,null,null,"Low","High","col.code",0,null,null,0,null,null,0,null,null,0,null,null,null,0,null,null,0]
{"$rows_left_out":7}
{"sheet":"aqi_breaks_china","index":8,"n_rows":16,"n_cols":24,"rows_kept":16,"cut":false,"hidden":false,"merged":[[8,3,8,4],[0,1,2,1],[0,2,2,15],[4,6,4,23]]}
[null,5,"CHINA AQI Break Points Information"]
[]
[]
[]
[null,"Number of bins",null,"Number of polls",null,null,"Break Points"]
[null,{"$f":"MAX(B11:B19)","v":6},null,{"$f":"MAX(G6:X6)","v":18},null,null,1,2,3,4,5,6,7,8,9,10,11,12,13,14,15,16,17,18]
[null,null,null,null,null,null,"PM2.5","PM2.5","PM2.5","PM10","PM10","PM10","SO2","SO2","SO2","NO2","NO2","NO2","CO","CO","CO","Ozone","Ozone","Ozone"]
[null,null,null,null,null,null,"24hr","8hr","1hr","24hr","8hr","1hr","24hr","8hr","1hr","24hr","8hr","1hr","24hr","8hr","1hr","24hr","8hr","1hr"]
[null,null,null,"AQI",null,null,"ug/m3","ug/m3","ug/m3","ug/m3","ug/m3","ug/m3","ug/m3","ug/m3","ug/m3","ug/m3","ug/m3","ug/m3","ug/m3","ug/m3","ug/m3","ug/m3","ug/m3","ug/m3"]
[null,null,null,"Low","High","col.code",0,null,null,0,null,null,0,null,null,0,null,null,0,null,null,null,0,0]
{"$rows_left_out":7}
{"sheet":"aqi_breaks_skorea","index":9,"n_rows":32,"n_cols":24,"rows_kept":32,"cut":false,"hidden":false,"merged":[[8,3,8,4],[0,1,2,1],[0,2,2,15],[4,6,4,23],[21,6,21,23]]}
[null,6,"S.KOREA AQI Break Points Information"]
[]
[]
[]
[null,"Number of bins",null,"Number of polls",null,null,"Break Points"]
[null,{"$f":"MAX(B11:B20)","v":6},null,{"$f":"MAX(G6:X6)","v":18},null,null,1,2,3,4,5,6,7,8,9,10,11,12,13,14,15,16,17,18]
[null,null,null,null,null,null,"PM2.5","PM2.5","PM2.5","PM10","PM10","PM10","SO2","SO2","SO2","NO2","NO2","NO2","CO","CO","CO","Ozone","Ozone","Ozone"]
[null,null,null,null,null,null,"24hr","8hr","1hr","24hr","8hr","1hr","24hr","8hr","1hr","24hr","8hr","1hr","24hr","8hr","1hr","24hr","8hr","1hr"]
[null,null,null,"AQI",null,null,"ug/m3","ug/m3","ug/m3","ug/m3","ug/m3","ug/m3","ug/m3","ug/m3","ug/m3","ug/m3","ug/m3","ug/m3","ug/m3","ug/m3","ug/m3","ug/m3","ug/m3","ug/m3"]
[null,null,null,"Low","High","col.code",null,null,null,0,null,null,0,null,null,0,null,null,null,0,null,null,0]
{"$rows_left_out":23}
{"sheet":"aqi_breaks_singapore","index":10,"n_rows":32,"n_cols":24,"rows_kept":32,"cut":false,"hidden":false,"merged":[[0,1,2,1],[0,2,2,15],[4,6,4,23],[8,3,8,4],[21,6,21,23]]}
[null,7,"SINGAPORE AQI Break Points Information"]
[]
[]
[]
[null,"Number of bins",null,"Number of polls",null,null,"Break Points"]
[null,{"$f":"MAX(B11:B20)","v":6},null,{"$f":"MAX(G6:X6)","v":18},null,null,1,2,3,4,5,6,7,8,9,10,11,12,13,14,15,16,17,18]
[null,null,null,null,null,null,"PM2.5","PM2.5","PM2.5","PM10","PM10","PM10","SO2","SO2","SO2","NO2","NO2","NO2","CO","CO","CO","Ozone","Ozone","Ozone"]
[null,null,null,null,null,null,"24hr","8hr","1hr","24hr","8hr","1hr","24hr","8hr","1hr","24hr","8hr","1hr","24hr","8hr","1hr","24hr","8hr","1hr"]
[null,null,null,"AQI",null,null,"ug/m3","ug/m3","ug/m3","ug/m3","ug/m3","ug/m3","ug/m3","ug/m3","ug/m3","ug/m3","ug/m3","ug/m3","ug/m3","ug/m3","ug/m3","ug/m3","ug/m3","ug/m3"]
[null,null,null,"Low","High","col.code",0,null,null,0,null,null,0,null,null,null,null,0,null,0,null,null,0,0]
{"$rows_left_out":23}
{"sheet":"Equations","index":11,"n_rows":0,"n_cols":0,"rows_kept":0,"cut":false,"hidden":false,"merged":[]}

{"sheet":"Unit_Conversion","index":12,"n_rows":14,"n_cols":18,"rows_kept":14,"cut":false,"hidden":false,"merged":[]}
[]
[]
[null,"Conversion at temperature T [°C] and pressure p [atm] "]
[null,"temp",15,null,"gas constant =",null,null,null,{"$f":"22.414/273.16","v":8.2054473568604486E-2},null,null,null,null,null,null,null,null,"Units"]
[null,"press",1,null,"volume 1 mole =",null,null,null,{"$f":"I4*(C4+273.16)/C5","v":23.644817103529071},null,null,null,null,null,null,null,null,"micro-g/m3"]
[null,null,null,null,null,null,null,null,null,null,null,null,null,null,null,null,null,"mg/m3"]
[null,null,null,null,"from",null,"to",null,"from",null,"to",null,null,null,null,null,null,"ppm"]
[null,null,"MW",null,"ppm",null,"ug/m3",null,"ppb",null,"ug/m3",null,null,null,null,null,null,"ppb"]
[null,"PM2.5",0,null,1,"ð",0,null,1,"ð",0,"<-- not supported"]
[null,"PM10",0,null,1,"ð",0,null,1,"ð",0,"<-- not supported"]
{"$rows_left_out":5}
{"sheet":"break_point_tally","index":13,"n_rows":15,"n_cols":24,"rows_kept":15,"cut":false,"hidden":false,"merged":[[3,12,3,14],[3,15,3,17],[3,18,3,20],[3,21,3,23],[3,3,3,5],[3,6,3,8],[3,9,3,11]]}
[]
[]
[null,null,null,1,2,3,4,5,6,7,8,9,10,11,12,13,14,15,16,17,18]
[null,null,null,"PM2.5",null,null,"PM10",null,null,"SO2",null,null,"NO2",null,null,"CO",null,null,"Ozone",null,null,"NH3"]
[null,null,null,"24hr","8hr","1hr","24hr","8hr","1hr","24hr","8hr","1hr","24hr","8hr","1hr","24hr","8hr","1hr","24hr","8hr","1hr","24hr","8hr","1hr"]
[null,1,"USA","x",null,null,"x",null,null,"x",null,null,"x",null,null,null,"x",null,null,"x","x"]
[null,2,"EU","x",null,null,"x",null,null,null,null,"x",null,null,"x",null,null,null,null,null,"x"]
[null,3,"UK","x",null,null,"x",null,null,null,null,"x",null,null,"x",null,null,null,null,"x"]
[null,4,"India","x",null,null,"x",null,null,"x",null,null,"x",null,null,null,"x",null,null,"x"]
[null,5,"China","x",null,null,"x",null,null,"x",null,null,"x",null,null,"x",null,null,null,"x","x"]
{"$rows_left_out":6}
{"sheet":"Concentrations","index":14,"n_rows":25,"n_cols":14,"rows_kept":25,"cut":false,"hidden":false,"merged":[[16,1,18,1],[19,1,21,1],[22,1,24,1],[0,1,3,11],[7,1,9,1],[10,1,12,1],[13,1,15,1],[4,1,4,11]]}
[null,"Converting all the pollutant concentrations to micro-g/m3"]
[]
[]
[]
[null,"NOTHING TO CHANGE HERE"]
[null,null,null,"input","input",null,null,null,"input","output"]
[null,null,"reqd.time.avg","conc","Unit",null,"pollname","MW","unit.code","conc - ug/m3","<== used for AQI calculations",null,null,"pollname"]
[null,"PM2.5","24hr",{"$f":"Calculator!D8","v":0},{"$f":"Calculator!E8","v":0},null,"PM2.5",{"$f":"IF(G8=0,0,INDEX(Unit_Conversion!$C$9:$C$14,MATCH(Concentrations!G8,Unit_Conversion!$B$9:$B$14,0)))","v":0},{"$f":"MATCH(E8,Unit_Conversion!$R$5:$R$8,0)","v":{"$error":"#N/A"}},120,null,null,1,{"$f":"G8 & \"-\" & C8","v":"PM2.5-24hr"}]
[null,null,"8hr",{"$f":"Calculator!D9","v":"<-- check if selection is valid or not"},{"$f":"Calculator!E9","v":0},null,"PM2.5",{"$f":"IF(G9=0,0,INDEX(Unit_Conversion!$C$9:$C$14,MATCH(Concentrations!G9,Unit_Conversion!$B$9:$B$14,0)))","v":0},{"$f":"MATCH(E9,Unit_Conversion!$R$5:$R$8,0)","v":{"$error":"#N/A"}},0,null,null,2,{"$f":"G9 & \"-\" & C9","v":"PM2.5-8hr"}]
[null,null,"1hr",{"$f":"Calculator!D10","v":0},{"$f":"Calculator!E10","v":0},null,"PM2.5",{"$f":"IF(G10=0,0,INDEX(Unit_Conversion!$C$9:$C$14,MATCH(Concentrations!G10,Unit_Conversion!$B$9:$B$14,0)))","v":0},{"$f":"MATCH(E10,Unit_Conversion!$R$5:$R$8,0)","v":{"$error":"#N/A"}},0,null,null,3,"PM2.5-1hr"]
{"$rows_left_out":16}
{"sheet":"Country","index":15,"n_rows":16,"n_cols":11,"rows_kept":16,"cut":false,"hidden":false,"merged":[[0,1,3,11],[4,1,4,11]]}
[null,"Countries with AQI methodologies, included in this workbook"]
[]
[]
[]
[null,"NOTHING TO CHANGE HERE"]
[]
[null,null,{"$f":"MATCH(Calculator!$E$5,D9:D16,0)","v":{"$error":"#N/A"}},"<--Selected",null,null,{"$f":"MATCH(Calculator!$E$5,H9:H16,0)","v":2},"<--Selected",null,{"$f":"MATCH(Calculator!$E$7,K9:K16,0)","v":1},"<--Selected"]
[null,null,null,"Country's",null,null,null,"pollutant",null,null,"time frame"]
[null,null,1,"USA",null,null,1,"PM2.5",null,1,"24hr"]
[null,null,2,"EU",null,null,2,"PM10",null,2,"8hr"]
{"$rows_left_out":6}