{"text_format":"1","workbook":"xlsx","n_sheets":5,"sheets":["README","baseInfo","distributions","distribution_map","gridded_emissions"],"not_rendered":{"charts":0,"images":0,"macros":1,"external_links":0,"defined_names":1,"comments":0,"pivot_tables":0},"unopened":[],"bounds":{"document_bytes":16777216,"sheet_cells":100000,"rows_first":2000,"rows_last":500,"rows_between":2000,"halvings":0,"cell_chars":16384,"cell_head_chars":4096},"cells_cut":0,"cells_raw":0,"read":"whole","date_system":"1900"}

{"sheet":"README","index":0,"n_rows":13,"n_cols":4,"rows_kept":13,"cut":false,"hidden":false,"merged":[]}
[]
[]
[null,null,"1. Enter the airshed grid numbers. The size of the grid is irrelevant in this exercise"]
[null,null,"2. Click on \"make empty grid\" box to check the look of the grid numbers entered"]
[null,null,"3. Enter the number of proxy categories, proxy category names -- this must match the order and names in the distributions worksheet"]
[null,null,"4. Enter the total emissions for each of the vehicle categories -- current set to 6"]
[null,null,"5. Proxy categories is set to 8 -- user can increase this and make the necessary changes in the VBA"]
[null,null,"6. Enter the proxy weights to be used gridding"]
[null,null,null,"Thumb rules -- most of the heavy duty vehicle exhaust will be on the highways"]
[null,null,null,"Thumb rules -- 2Ws, 3Ws, 4Ws exhaust will be on highways, urban roads, and commercial hub grids"]
[null,null,"7. Click on grid emissions -- this will make the text file in \"gridded_emissions\" and display the same in \"distribution_map\""]
[]
[null,null,"Extra -- in the \"distributions\" page, select the proxy column number to map and see how it looks"]

{"sheet":"baseInfo","index":1,"n_rows":30,"n_cols":12,"rows_kept":30,"cut":false,"hidden":false,"merged":[]}
[]
[null,"Green cells = input"]
[]
[null,"Airshed Box Name","APnACity"]
[null,"airshed nx",50,"<== grid (1,1) is the southwest corner (as per longitude/latitude)"]
[null,"airshed ny",50]
[null,"airshed size (grids)",{"$f":"C5 & \" * \"&  C6","v":"50 * 50"},"<== distributions worksheet data must match this matrix"]
[null,"No. distrbution proxies",8,"<== number of categories for distributing the emissions (max of table below)"]
[null,"No. vehicle categories",6,"<== max from the table below"]
[]
[]
[null,null,"Category ==>",1,2,3,4,5,6,7,8]
[null,null,"distributions column # ==>",{"$f":"MATCH(D14,distributions!$C$2:$J$2,0)","v":1},{"$f":"MATCH(E14,distributions!$C$2:$J$2,0)","v":2},{"$f":"MATCH(F14,distributions!$C$2:$J$2,0)","v":3},{"$f":"MATCH(G14,distributions!$C$2:$J$2,0)","v":4},{"$f":"MATCH(H14,distributions!$C$2:$J$2,0)","v":5},{"$f":"MATCH(I14,distributions!$C$2:$J$2,0)","v":6},{"$f":"MATCH(J14,distributions!$C$2:$J$2,0)","v":7},{"$f":"MATCH(K14,distributions!$C$2:$J$2,0)","v":8}]
[null,null,"Emissions","HW","Ur.SecRds","Ur.OthRds","NonUr.SecRds","NonUr.OthRds","Pop","Ind.Hubs","Com.Hubs","100%-sum-check"]
[1,"2Ws",2000,0.2,0.2,0.05,0.05,0.05,0,0.1,{"$f":"100%-SUM(D15:J15)","v":0.35},{"$f":"SUM(D15:K15)","v":1}]
[2,"3Ws",500,0.3,0.2,0.05,0.05,0.05,0,0.05,{"$f":"100%-SUM(D16:J16)","v":0.29999999999999982},{"$f":"SUM(D16:K16)","v":1}]
[3,"4Ws",2000,0.2,0.4,0.05,0.05,0.05,0,0.05,0.19999999999999973,1]
[4,"Buses",1000,0.2,0.5,0.05,0,0,0,0.05,0.19999999999999996,1]
[5,"LDVs",2000,0.3,0.15,0.05,0.05,0.05,0,0.2,0.19999999999999996,1]
[6,"HDVs",8000,0.7,0.05,0.05,0.05,0.05,0,0.1,0,1.0000000000000002]
{"$rows_left_out":11}
{"sheet":"distributions","index":2,"n_rows":2502,"n_cols":13,"rows_kept":2502,"cut":false,"hidden":false,"merged":[]}
[null,"category ==>",1,2,3,4,5,6,7,8]
["gridx","gridy","HW","Ur.SecRds","Ur.OthRds","NonUr.SecRds","NonUr.OthRds","Pop","Ind.Hubs","Com.Hubs"]
[1,1,0,0,0,0,0,63.470460577504412,0,0]
[2,1,0,0,0,0,0,95.205690866256603,0,0]
[3,1,0,0,0,0,0,75.937872476657034,0,0,null,7,"<== change the category number"]
[4,1,0,0,0,0,0,91.80548762103318,0,0]
[5,1,2.4746827550506199,0,0,0,0,709.39124557706521,0.5,2]
[6,1,0,0,0,0,0,317.35230288752206,0,0]
[7,1,0,0,0,0,0,2189.8604205810907,0,2]
[8,1,0,0,0,0,0,539.49891490878758,0,0]
[9,1,1.3240634334758199,0,0,0,0,398.59898135722619,0,0]
[10,1,0,0,0,0,0,40.802438942681405,0,0]
[11,1,0,0,0,0,0,28.335027043528754,0,0]
[12,1,0,0,0,0,0,23.801422716564151,0,0]
[13,1,0,0,0,0,0,87.271883294068559,0,0]
[14,1,0,0,0,0,0,37.402235697457947,0,0]
[15,1,1.05548064368109,0,0,0,0,5043.2663348626702,0.5,11]
[16,1,0.76191531697733295,0,0,0,0,389.88997211895571,0,1]
[17,1,0,0,0,0,0,40.802438942681405,0,0]
[18,1,0.21596763267235899,0,0,0,0,425.02540565293134,0,0]
{"$rows_left_out":2483}
{"sheet":"distribution_map","index":3,"n_rows":53,"n_cols":52,"rows_kept":53,"cut":false,"hidden":false,"merged":[]}
[null,null,null,null,{"$f":"INDEX(baseInfo!B23:B30,distributions!L5)","v":"IndustrialHubs"}]
[]
[null,50,6.0296586930467821,6.0625638155607051,35.829037188060951,39.613220369567962,20.764432270499501,8.1098475838860153,1.1514471025281086,0.84262675508112062,0.13380587299291186,0,0.26761174598582371,0.13380587299291186,6.7817277022356008E-3,14.289217462217589,26.939062729540634,1.6017927592735131,0,0,1.6790574618518121,0,0,0,0,5.6100921679360543,2.0160435147366038,0,8.5816225682306015,5.4437399609686885,0.20946761147588772,0.15562559811543142,1.3651208125693164,1.2501202123876458,6.5096215571292433,6.4780839626398272,12.206948929825327,0,0.31929706337196051,0,0,0,0,1.4498623621701068,0,3.5492180640871549,1.3414442511617346,0.21161959946138653,15.251429675688787,7.7371780933583727,1.5277133868467205,0]
[null,49,0,4.2463032530486355,14.568693437809827,14.497372273039648,10.511738108712024,13.505032594577587,8.2845218059772918,7.9046244648049235,7.2011509096763184,6.778035158904042,6.9253348279107065,6.6734097832221604,4.5674796170453282,6.131307729441823,23.557626237876455,11.610062930531882,0,0.81165736203761218,2.6792539212997819,0,0,0,3.8365745815309262,6.6428499720996106,0,0,0,0,1.1870144253495343,2.1197095892365501,0.54022726187358416,0,0,6.0310751558158575,19.390701791097822,0,1.5659208478753832,2.5101236628298378,2.7276645067891563,0.72957892756643816,0.67436403484391483,0.91727360699636962,0.67288009615525735,0.68757269871189319,1.6077520317495684,1.6164172793529401,13.553553628082483,0,6.9549891876053902,1.6832136600811425]
[null,48,0,6.8452543665717283,2.1379770291695528,0,7.9585986885968882,0,0,0.13380587299291186,0.13380587299291186,0,0.97643262807403242,0.13380587299291186,2.8328665888983959,6.8106621056910859,25.353750837871488,12.704838140744428,1.328035862615301,1.7751130432527666,0.90598270842852302,0.5118565582112713,0,1.7405708511943865,6.6034011745861285,0.78601056352800713,1.5788866037142699,0,0,0,0,0,2.4579828778810353,0,0,0,14.225090070868157,0,2.7223725802486514,9.2052278905479028,2.5370121802419243,0,1.7333886299126751,0.2401182454625756,3.5545448599430478,1.3458216025853247,9.6153233326945531E-2,14.565331824743087,0,0,0,7.8510504111294717]
[null,47,3.7451027887107506,4.3580404721528483,0,0,6.4765189540594319,0,0,0.84323820112392722,3.6044931440369474,0,0,0,0,0,0.13380587299291186,8.9056201379960864,17.027796464610393,13.923156255728774,7.2521999880832855,8.5391616735971709,6.1302967109663768,15.565604424290825,6.8779228429265249,0,1.0208998818876369,0.31841871964814172,1.9996316047372711,0,0,0,1.38023408494432,6.0929769215515908,0,0,16.640350449617781,0.13380587299291186,27.420559950530553,12.53537133554204,0.86824589287011367,10.749482453402209,1.2918057897891075,0.47999790726137997,2.080644715686812,0.29346861947379438,8.7482141423360407,9.68212840887068,0,0,0,1.5002778470412719]
[null,46,6.0375974649066269,0,0,0.13380587299291186,7.3550844611043313,0,0,0.5253139468465946,1.5974600888400761,5.2899854052104534,5.2781581508734572,0.17640397924521786,0,0,0,0,0.25219188000433179,10.179289072489491,22.511400668436963,11.257784152631375,15.674916436589768,12.934268806375323,4.9925881073286131,6.5385098606072862,7.9479934822689708,0,0.65714418558797383,2.0436173041772077,1.266165751555361,0.184249468979753,5.4143571038466396,8.2605714894547688,6.1739394656957769,22.836090568859763,32.443914377104008,18.923460477065063,13.737825446781741,21.893915992376908,0.66710018338297761,17.06607622156131,6.3923752205726139,1.8389851233306063,0,0.19938996209449888,15.096858967925451,0,0,0,0,0]
[null,45,0,0,0,0,6.4169272029125757E-2,6.7211606890204596,0,0,0,0,0,5.1068139456741921,5.6572609645617113,1.2042528569362065,0,0,0,4.7484397347700389,28.292475003809024,24.228367380898412,31.080242638307585,3.4338194504622761,0.23048293779889484,0,0.87787342947698277,7.1787155089105363,5.1976470834796622,0,0,0,0,5.5550472846972854,5.943385844449887,29.666666514374,24.194495793990104,18.968456784783424,31.419788827132283,18.854754710962183,13.471040077824062,17.926691645823336,28.511966115886214,1.0417201112337686,0.46128059440855407,10.701226097981721,7.8760055212321651,0,0,0,0,0]
[null,44,0,0,0,0,0,7.1916405347862504,0,0,0,0,0,0,6.3979192610269617E-2,6.2597353601620682,4.1826113854792686,6.2980808653126328,6.3470001198672481,4.419119272638353,12.167820258083694,31.399220589768227,20.930753233940255,0.70882088208820881,0,0,0.26761174598582371,2.1863329248679046,2.5287194461609843,6.8312550448387075,5.9875861051495729,8.9762428173344553,7.4134568591419692,11.217393172699099,14.124817978153827,18.853603580846833,20.608993218988573,32.162659415192039,35.331624449013411,36.882483179358566,7.4976014369361881,1.6532998408046591,3.0159665577543828,16.083817074327847,8.3063465596345427,18.883037550718534,0,0,0,0,0,0]
[null,43,0,0,0,0,0,2.7262687861732848,4.5093291691081081,0,0,0,0,2.6512860343250577,6.3591137868041141,6.3386976770596242,9.0384021243204185,3.4386028255280712,0,0.23288871770706743,0.85605142727627148,2.9739477594776114,14.080983039229524,11.202513672112699,0,0,0,1.437659347134753,0,0,0,7.7588731156424116,0.75253303777255542,13.544607285956642,29.548856777000768,15.013253135185085,23.44344810659004,31.983526015416462,20.030125921715914,37.484369986264667,0.18541705906907868,2.2386954720707695,4.6980533143069216,1.093613889209522,18.819345632512761,33.749123440003551,0,0,0,0.97643262807403242,0,0]
[null,42,0,0,0,0,0,0,6.7148849482194226,0,0,0.15520877488158991,8.5039765994074159,3.3870452195016654,0,0,0,2.8521541614921428,4.2029745409295858,1.3736343544694392,0,0,0.20114398748115087,10.773115621654766,18.49636780414593,0.41691944748458948,0.87403487988446682,0.57858920544983306,0,0.13380587299291186,10.544830502225052,4.0305789356753881,0.40141761897873551,2.4101671766261075,18.940650360574729,24.549815422110889,41.52869996396052,17.952636096974981,16.18540874191191,6.5071617806222823,2.4482972309960629,2.2901422264337223,0,0,7.2565362721826263,8.028226227148263,0.48773410990916954,0,0,1.1724445004787147,0.13380587299291186,0]
[null,41,0,0,0,0,0,2.9036127116019751E-2,11.412142667999426,7.1067876050139294,6.185434414981227,6.7796717657002503,0,0,0,0,0,0,5.1875991878552261,2.4100563159341735,0,0,1.9355355674467716,0,1.1103417711127701,19.914293519699502,3.8322889431168039,0.43597926303062168,1.5187486979951763,0.20597676072945642,15.369181282272324,2.4961934111315429,0,14.465925182909453,8.8782880346108577,24.877897528172948,24.613632896699624,24.394154203326597,12.33497119698948,0.10962882580030472,6.3935281805574853,0.17340060114807015,0.13380587299291186,5.8835021925503721,2.717753064186994,0,6.3166529651213574,6.2453491617036114,7.3803199536768958,5.4554771350176186,0,0]
[null,40,0,0,0,0,0,0,5.5775338380138777,1.9229149016333484,0,0.13380587299291186,0,0,0,0,0,0,0.13380587299291186,5.9914005494404883,0,0.70882088208820881,1.5236927598393855,0,0.70525910205580922,1.7854992342601381,14.254384864697533,15.059188386398111,0,0,0.38808497677067311,0,2.651944634081369,38.711920927237372,14.744420715194787,44.771770887817574,17.080916983975079,4.2725661205558847,0.70882088208820881,0.513085058955847,1.0881996206762921,0,0,7.0531860390574987,0.13380587299291186,0,0,0,0,3.3717048106879353,5.5840077495658536,0.68950836423323225]
[null,39,0,0,0,0,0,0,0,6.7473555694304732,0,0,0,0,0,0,0.13380587299291186,0.70882088208820881,0,3.5025531612891152,2.4373124706957014,0,1.2538337506691088,0.78639937489045209,1.0931002139094455,0,0.93711765838206074,8.3489262189822533,13.972944165746133,20.891239149427896,5.572692886012053,13.610949863375858,14.644027170906918,8.0446027142971754,23.877079383282243,34.888029959765532,12.332559602628944,12.223700971950191,11.699904010565316,2.6668060721299756,0.40141761897873551,0,2.3651854875321785,4.9423191808914311,0,0,1.9057541012334496,0,0,0,2.1329641859321598,9.5050310241479945]
[null,38,0,0,0,0,0,0,0,6.5487024516106445,0,0,0,0,0,0,1.2876821817887825,3.4794803581394422,1.3052994638890065,1.334494432257824,6.8429716452849778,4.9989415090243128,0.2710388168750576,1.4553477383958349,1.5450388913940749,12.527452934631645,0.29446860446480694,9.4941404023371323,3.1146210639530754,46.994033904250841,29.515214953281298,1.8637890219480289,0,0.15880403452079916,4.6185122695349818,30.027740221845786,20.024843063471426,0.13380587299291186,0,1.5349527784299601,0.13380587299291186,0.11395706959768945,6.4919876922370028,0,0,5.2615501215214167,9.8519902627833673,1.2817447200307803,0,0.21664773161680317,3.8045475848111101,1.3754532871383778]
[null,37,0,0,0,0,0,0,3.1705450592884932E-2,7.9326756765490192,0,0,0,0,0,0.13380587299291186,7.0063711950202672,1.5033690275603502,1.3731174679157196,0,1.5979134096622347,0,0.16913966436560349,1.0104444561707773,1.4707637807474658,5.2328224958534992,1.2316586667022726,6.933228287706644,14.895688001288239,7.6668374888576123,26.842198327381205,5.8195311341561302,0.18533368234721981,2.2461248027724947,0.25467728625291641,21.720807059539755,6.5028211916439478,8.1028383906868253,1.6320120625420682,2.7511835278746206,4.0354085420288781,6.603902644041149,8.2720989858342158,0,0,0,1.9289771170636256,0.3848814194783603,1.2143742020451873,3.4513670858837688,2.1484260717569628,1.3222734830322618]
[null,36,0.13380587299291186,0,0,0,0,0,0,6.4484934735931896,0,0,0,0,3.6813895665119354,0.70882088208820881,0.84262675508112062,0,0.35484166129403383,1.5177022440978145,0,0.13380587299291186,0.95164096636869577,0,4.1234113512242105,0.36156970124808219,3.1493857600406576,24.694604209328947,2.6291659784769394,0.23281516825541765,22.301672869283987,3.0249187222448715,1.1102385010669442,0,0,15.535220661943359,2.9940996369645991,2.6646826649467901,21.910542623075841,1.208652118896659,9.3351050001464966,6.2545114021565311,2.3273125629387339,0,0,0,0,0.70090636792899708,1.5917868492328764,1.3023393249839323,1.8238454501541774,7.7386718129334771]
[null,35,0,0,0,0,0,0,0,6.8422121206456499,0,0,0,0,1.6592762902571012,5.9221877454297109,14.598420501062105,0.84262675508112062,5.5016891633233724,2.4508123368538017,5.9199703325097612,7.7090934190072842,2.1085237314025651,9.2604812359141545E-2,3.5110522295569124,0.548090198988749,17.406890658800634,2.2234979407880977,0,4.4602265328378209E-2,13.737579483822049,5.2867085432344396,1.3380587299291185,0.13380587299291186,2.1356750063450574,15.119403758144001,7.1816700326696985,3.4419538828377787,0,0.281503606938177,19.844201904497513,11.284415054719073,1.4176417641764176,0,0,0,0,1.0853099592768118,0.46842796979434426,4.7495124805012674,7.2852898169676763,1.4415706769110632]
[null,34,2.1062212957371877,1.2582126571614696,1.2872311350519547,1.0038400059822392,0.5928064492102243,1.2659760841906897,0.18421479042072017,11.290556090447449,0,0,0.26761174598582371,0,0.40141761897873551,0,7.3872397852192897,1.1266425084911669,0,2.0884785204770919,0.13380587299291186,0,0,0.40141761897873551,15.287173271477343,15.362688212056476,40.395851417993939,15.144591338128327,13.193504845618316,13.206357252546921,31.954288262378007,1.0663775363767902,5.3180361760092065,5.314597555968005,7.256985593329107,25.133842038376212,2.0434291832509923,1.1945898077466865,0,0,7.5532064548410691,0,0,0,0,0,0,2.4226490764583204,9.4599384080117588,3.2916746130440768,0,0.90291178275736195]
[null,33,1.36673811778576,0,0,0.29471243193142199,0.68417641469062729,0,2.1644791796213863,5.4420815921252395,0,0,0,0,0,0,5.5920094195895791,2.2404223146797269,4.3510477697183886E-2,2.4858350631316366,0,2.3943875503398675,14.266467688320647,16.11408917372232,0.49802851820713145,13.057127320227998,10.48015076146776,1.195762336456295,3.1772370563188743,3.0616257476028723,21.180428390020293,20.073002130533538,20.176249194405905,11.956828802600757,14.747428000904488,21.085316970600772,3.8125252792479349,9.4841801745273369,9.7073880375878971,7.4915137594761232,9.1576449697052862,0,0,0.13380587299291186,0,0,3.1647618131399353,7.1724661664617608,0,1.4846712455909485,0,0]
{"$rows_left_out":34}
{"sheet":"gridded_emissions","index":4,"n_rows":2503,"n_cols":10,"rows_kept":2503,"cut":false,"hidden":false,"merged":[]}
[null,null,{"$f":"SUM(C4:C10501)","v":2000.0000000000005},500.00000000000034,2000.0000000000027,999.99999999999864,2000.0000000000002,8000.0000000000082,{"$f":"SUM(I4:I10501)","v":15499.999999999987},"<== cross check for totals"]
[null,"vehicle category ==>",1,2,3,4,5,6]
["gridx","gridy","2Ws","3Ws","4Ws","Buses","LDVs","HDVs","total"]
[1,1,0,0,0,0,0,0,0]
[2,1,0,0,0,0,0,0,0]
[3,1,0,0,0,0,0,0,0]
[4,1,0,0,0,0,0,0,0]
[5,1,0.96388206492531936,0.32267983686607749,0.8754810651262217,0.43774053256311091,1.39680184924841,11.176639921217854,15.173225269946993]
[6,1,0,0,0,0,0,0,0]
[7,1,0.10125849848112252,2.1698249674526243E-2,5.7861999132069936E-2,2.8930999566034999E-2,5.7861999132069998E-2,0,0.26761174598582371]
[8,1,0,0,0,0,0,0,0]
[9,1,0.4133825607827592,0.15501846029353469,0.4133825607827592,0.2066912803913796,0.62007384117413877,5.7873558509586287,7.5959045543831998]
[10,1,0,0,0,0,0,0,0]
[11,1,0,0,0,0,0,0,0]
[12,1,0,0,0,0,0,0,0]
[13,1,0,0,0,0,0,0,0]
[14,1,0,0,0,0,0,0,0]
[15,1,0.97645973663391161,0.25416487110527347,0.69277448976407741,0.34638724488203887,0.99255248815803654,4.9734419208274288,8.2357807513707666]
[16,1,0.2885049407434106,0.10005250915083162,0.26680669106888427,0.13340334553444216,0.38574453682030901,3.3302596810398901,4.5047717043577675]
[17,1,0,0,0,0,0,0,0]
{"$rows_left_out":2483}